[botan-devel] Botan 1.11.8 released

Uri Blumenthal uri at MIT.EDU
Sat Feb 15 22:17:11 EST 2014


On Feb 14, 2014, at 21:44 , Jack Lloyd <lloyd at randombit.net> wrote:
> Good morning,
> 
> Botan 1.11.8 has been released.

And here is the first compilation result under Mac OS X 10.9.1 Mavericks, with clang++-3.4.:

-------------- next part --------------
An embedded and charset-unspecified text was scrubbed...
Name: b1-out.txt
URL: <http://lists.randombit.net/pipermail/botan-devel/attachments/20140215/5507e292/attachment-0001.txt>
-------------- next part --------------


With g++-4.8.2, cvc does not compile:

g++ -m64 -pthread -fPIC -fvisibility=hidden -std=c++11 -D_REENTRANT -fstack-protector -maes -mpclmul -msse2 -mssse3 -msse4.2 -mtune=native -O3 -momit-leaf-frame-pointer -Wall -Wextra -Wstrict-aliasing -Wstrict-overflow=5 -Wcast-align -Wmissing-declarations -Wpointer-arith -Wcast-qual -Wold-style-cast -Wzero-as-null-pointer-constant -I/opt/local/include -Ibuild/include -c src/lib/cert/cvc/asn1_eac_str.cpp -o build/obj/lib/cert_cvc_asn1_eac_str.o
In file included from src/lib/cert/cvc/asn1_eac_str.cpp:9:0:
build/include/botan/eac_asn_obj.h:90:22: error: 'chrono' in namespace 'std' does not name a type
       EAC_Time(const std::chrono::system_clock::time_point& time,
                      ^
build/include/botan/eac_asn_obj.h:90:47: error: expected unqualified-id before '::' token
       EAC_Time(const std::chrono::system_clock::time_point& time,
                                               ^
build/include/botan/eac_asn_obj.h:90:47: error: expected ')' before '::' token
build/include/botan/eac_asn_obj.h:90:35: error: expected ';' at end of member declaration
       EAC_Time(const std::chrono::system_clock::time_point& time,
                                   ^
build/include/botan/eac_asn_obj.h:90:47: error: 'time_point' in namespace '::' does not name a type
       EAC_Time(const std::chrono::system_clock::time_point& time,
                                               ^
build/include/botan/eac_asn_obj.h:125:22: error: 'chrono' in namespace 'std' does not name a type
    ASN1_Ced(const std::chrono::system_clock::time_point& time) :
                      ^
build/include/botan/eac_asn_obj.h:125:47: error: expected unqualified-id before '::' token
       ASN1_Ced(const std::chrono::system_clock::time_point& time) :
                                               ^
build/include/botan/eac_asn_obj.h:125:47: error: expected ')' before '::' token
build/include/botan/eac_asn_obj.h:125:35: error: expected ';' at end of member declaration
       ASN1_Ced(const std::chrono::system_clock::time_point& time) :
                                   ^
build/include/botan/eac_asn_obj.h:125:47: error: 'time_point' in namespace '::' does not name a type
       ASN1_Ced(const std::chrono::system_clock::time_point& time) :
                                               ^
build/include/botan/eac_asn_obj.h:153:22: error: 'chrono' in namespace 'std' does not name a type
       ASN1_Cex(const std::chrono::system_clock::time_point& time) :
                      ^
build/include/botan/eac_asn_obj.h:153:47: error: expected unqualified-id before '::' token
       ASN1_Cex(const std::chrono::system_clock::time_point& time) :
                                               ^
build/include/botan/eac_asn_obj.h:153:47: error: expected ')' before '::' token
build/include/botan/eac_asn_obj.h:153:35: error: expected ';' at end of member declaration
       ASN1_Cex(const std::chrono::system_clock::time_point& time) :
                                   ^
build/include/botan/eac_asn_obj.h:153:47: error: 'time_point' in namespace '::' does not name a type
       ASN1_Cex(const std::chrono::system_clock::time_point& time) :
                                               ^
gmake: *** [build/obj/lib/cert_cvc_asn1_eac_str.o] Error 1


More information about the botan-devel mailing list